BDBM50062378 CHEMBL3397301
SMILES COc1ccc(cc1)-c1cc(ccn1)-c1c[nH]nc1-c1cc(C)cc(OC)c1
InChI Key InChIKey=UBAFETGQAZMNKV-UHFFFAOYSA-N
Data  1 IC50
  Tab Delimited (TSV)   2D SDfile   Computed 3D by Vconf -m prep SDfile
Find this compound or compounds like it in BindingDB:
Activity Spreadsheet -- Enzyme Inhibition Constant Data from BindingDB
Found 1 hit for monomerid = 50062378
TargetProto-oncogene tyrosine-protein kinase ROS(Homo sapiens (Human))
Korea University Of Science And Technology
Curated by ChEMBL
LigandPNGBDBM50062378(CHEMBL3397301)
Affinity DataIC50:  1.25E+3nM. Assay description: Inhibition of ROS1 (unknown origin) by HotSpot assay
In DepthDetails ArticlePubMed