BDBM50065853 22-cyclopropylmethyl-6-phenyl-14-oxa-11,22-diazaheptacyclo[13.9.1.01,13.02,21.04,12.05,10.019,25]pentacosa-4(12),5(10),6,8,15(25),16,18-heptaene-2,16-diol::CHEMBL318213
SMILES Oc1ccc2C[C@H]3N(CC4CC4)CC[C@@]45C(Oc1c24)c1[nH]c2cccc(-c4ccccc4)c2c1C[C@@]35O
InChI Key InChIKey=BODOIOJWEKAOMM-OBSSAXLPSA-N
Data  6 KI
  Tab Delimited (TSV)   2D SDfile   Computed 3D by Vconf -m prep SDfile
Find this compound or compounds like it in BindingDB:
Activity Spreadsheet -- Enzyme Inhibition Constant Data from BindingDB
Found 6 hits for monomerid = 50065853
TargetDelta-type opioid receptor(Rattus norvegicus (rat))
Southern Research Institute
Curated by ChEMBL
LigandPNGBDBM50065853(22-cyclopropylmethyl-6-phenyl-14-oxa-11,22-diazahe...)
Affinity DataKi:  52nM. Assay description: Displacement of [3H]DADLE from Opioid receptor delta 1 of rat brain membranes (DAMGO quenching mu receptor)
In DepthDetails ArticlePubMed
TargetDelta-type opioid receptor(Rattus norvegicus (rat))
Southern Research Institute
Curated by ChEMBL
LigandPNGBDBM50065853(22-cyclopropylmethyl-6-phenyl-14-oxa-11,22-diazahe...)
Affinity DataKi:  127nM. Assay description: Displacement of [3H]DADLE from morphine-insensitive Opioid receptor delta 1 (presence of 50 nM morphine) of rat brain membranes
In DepthDetails ArticlePubMed
TargetDelta-type opioid receptor(Rattus norvegicus (rat))
Southern Research Institute
Curated by ChEMBL
LigandPNGBDBM50065853(22-cyclopropylmethyl-6-phenyl-14-oxa-11,22-diazahe...)
Affinity DataKi:  284nM. Assay description: Displacement of [3H]DADLE from morphine-sensitive Opioid receptor delta 1 (presence of 300 nM DELT-II) of rat brain membranes
In DepthDetails ArticlePubMed
TargetKappa-type opioid receptor(Cavia porcellus (domestic guinea pig))
Southern Research Institute
Curated by ChEMBL
LigandPNGBDBM50065853(22-cyclopropylmethyl-6-phenyl-14-oxa-11,22-diazahe...)
Affinity DataKi:  435nM. Assay description: Displacement of [125I]OXY from Opioid receptor kappa 2b of guinea pig brain membranes (pretreated with BIT(mu) and FIT(delta) and in the presence of ...
In DepthDetails ArticlePubMed
TargetMu-type opioid receptor(Rattus norvegicus (rat))
Southern Research Institute
Curated by ChEMBL
LigandPNGBDBM50065853(22-cyclopropylmethyl-6-phenyl-14-oxa-11,22-diazahe...)
Affinity DataKi:  1.51E+3nM. Assay description: Displacement of [3H]DAMGO from Opioid receptor mu 1 of rat brain membranes
In DepthDetails ArticlePubMed
TargetKappa-type opioid receptor(Cavia porcellus (domestic guinea pig))
Southern Research Institute
Curated by ChEMBL
LigandPNGBDBM50065853(22-cyclopropylmethyl-6-phenyl-14-oxa-11,22-diazahe...)
Affinity DataKi:  2.97E+3nM. Assay description: Displacement of [3H]U-69593 from Opioid receptor kappa 1 of guinea pig brain membranes (pretreated with BIT and FIT to block mu and delta sites)
In DepthDetails ArticlePubMed