BDBM50066524 6-(3-Fluoro-5-nitro-phenyl)-2,2,4-trimethyl-1,2-dihydro-quinoline::6-(3-fluoro-5-nitrophenyl)-2,2,4-trimethyl-1,2-dihydroquinoline::CHEMBL117308
SMILES CC1=CC(C)(C)Nc2ccc(cc12)-c1cc(F)cc(c1)[N+]([O-])=O
InChI Key InChIKey=FWUZRFHZKYRBHJ-UHFFFAOYSA-N
Data  2 KI  1 IC50
  Tab Delimited (TSV)   2D SDfile   Computed 3D by Vconf -m prep SDfile
Find this compound or compounds like it in BindingDB:
Activity Spreadsheet -- Enzyme Inhibition Constant Data from BindingDB
Found 3 hits for monomerid = 50066524
TargetProgesterone receptor(Homo sapiens (Human))
Ligand Pharmaceuticals
Curated by ChEMBL
LigandPNGBDBM50066524(6-(3-Fluoro-5-nitro-phenyl)-2,2,4-trimethyl-1,2-di...)
Affinity DataKi:  5nM. Assay description: Binding affinity against Baculovirus-Expressed hPR-A
In DepthDetails ArticlePubMed
TargetProgesterone receptor(Homo sapiens (Human))
Ligand Pharmaceuticals
Curated by ChEMBL
LigandPNGBDBM50066524(6-(3-Fluoro-5-nitro-phenyl)-2,2,4-trimethyl-1,2-di...)
Affinity DataKi:  5nM. Assay description: Displacement of [3H]progesterone from Progesterone receptor
In DepthDetails ArticlePubMed
TargetProgesterone receptor(Homo sapiens (Human))
Ligand Pharmaceuticals
Curated by ChEMBL
LigandPNGBDBM50066524(6-(3-Fluoro-5-nitro-phenyl)-2,2,4-trimethyl-1,2-di...)
Affinity DataIC50:  70nM. Assay description: In vitro antagonist activity against human progesterone receptor isoform B(hPR-B) in mammalian(CV-1) cells
In DepthDetails ArticlePubMed