BDBM50067030 (1E,4Z,6E)-1,7-Bis-(3,4-dihydroxy-phenyl)-5-hydroxy-hepta-1,4,6-trien-3-one::(1E,4Z,6E)-1,7-bis(3,4-dihydroxyphenyl)-5-hydroxyhepta-1,4,6-trien-3-one::1,7-Bis-(3,4-dihydroxy-phenyl)-5-hydroxy-hepta-1,4,6-trien-3-one::1,7-bis(3,4-dihydroxyphenyl)-5-hydroxyhepta-1,4,6-trien-3-one::CHEMBL129964
SMILES Oc1ccc(C=CC(=O)CC(=O)C=Cc2ccc(O)c(O)c2)cc1O
InChI Key InChIKey=OJFGQVZAISEIPG-UHFFFAOYSA-N
Data  4 IC50  3 EC50
  Tab Delimited (TSV)   2D SDfile   Computed 3D by Vconf -m prep SDfile
Find this compound or compounds like it in BindingDB:
Activity Spreadsheet -- Enzyme Inhibition Constant Data from BindingDB
Found 7 hits for monomerid = 50067030
TargetHistone acetyltransferase p300(Homo sapiens (Human))
Sapienza University Of Rome
Curated by ChEMBL
LigandPNGBDBM50067030((1E,4Z,6E)-1,7-Bis-(3,4-dihydroxy-phenyl)-5-hydrox...)
Affinity DataIC50:  4.60E+4nM. Assay description: Inhibition of GST-p300 HAT assessed as histone acetylation
In DepthDetails ArticlePubMed
TargetIntegrase(Human immunodeficiency virus 1)
Sapienza University Of Rome
Curated by ChEMBL
LigandPNGBDBM50067030((1E,4Z,6E)-1,7-Bis-(3,4-dihydroxy-phenyl)-5-hydrox...)
Affinity DataIC50:  700nM. Assay description: Compound concentration required to reduce HIV-1 Integrase 3'-processing activity by 50%
In DepthDetails ArticlePubMed
TargetIntegrase(Human immunodeficiency virus 1)
Sapienza University Of Rome
Curated by ChEMBL
LigandPNGBDBM50067030((1E,4Z,6E)-1,7-Bis-(3,4-dihydroxy-phenyl)-5-hydrox...)
Affinity DataIC50:  708nM. Assay description: Inhibitory activity against HIV-1 Integrase (HIV-1-IN)
In DepthDetails ArticlePubMed
TargetBeta-secretase 1(Homo sapiens (Human))
Yamagata University
Curated by ChEMBL
LigandPNGBDBM50067030((1E,4Z,6E)-1,7-Bis-(3,4-dihydroxy-phenyl)-5-hydrox...)
Affinity DataIC50:  2.20E+6nM. Assay description: Inhibition of recombinant BACE1 (unknown origin)
In DepthDetails ArticlePubMed
TargetProtein kinase C epsilon type(Homo sapiens (Human))
University Of Houston
Curated by ChEMBL
LigandPNGBDBM50067030((1E,4Z,6E)-1,7-Bis-(3,4-dihydroxy-phenyl)-5-hydrox...)
Affinity DataEC50:  1.11E+4nM. Assay description: Binding affinity to GST-tagged PKCepsilon expressed in Escherichia coli BL21(DE3) by fluorescence quenching
In DepthDetails ArticlePubMed
TargetProtein kinase C theta type(Homo sapiens (Human))
University Of Houston
Curated by ChEMBL
LigandPNGBDBM50067030((1E,4Z,6E)-1,7-Bis-(3,4-dihydroxy-phenyl)-5-hydrox...)
Affinity DataEC50:  6.57E+3nM. Assay description: Binding affinity to GST-tagged PKCtheta expressed in Escherichia coli BL21(DE3) by fluorescence quenching
In DepthDetails ArticlePubMed
TargetProtein kinase C delta type(Homo sapiens (Human))
University Of Houston
Curated by ChEMBL
LigandPNGBDBM50067030((1E,4Z,6E)-1,7-Bis-(3,4-dihydroxy-phenyl)-5-hydrox...)
Affinity DataEC50:  1.25E+4nM. Assay description: Binding affinity to GST-tagged PKCdelta expressed in Escherichia coli BL21(DE3) by fluorescence quenching
In DepthDetails ArticlePubMed