BDBM50068285 CHEMBL3403372
SMILES CCn1c(NC(C)C)nc2c(csc2c1=O)C1CCN(C1)C(=O)c1ccccn1
InChI Key InChIKey=NLFMMOQCAASWGC-UHFFFAOYSA-N
Data  4 IC50
  Tab Delimited (TSV)   2D SDfile   Computed 3D by Vconf -m prep SDfile
Find this compound or compounds like it in BindingDB:
Activity Spreadsheet -- Enzyme Inhibition Constant Data from BindingDB
Found 4 hits for monomerid = 50068285
TargetHigh affinity cAMP-specific 3',5'-cyclic phosphodiesterase 7A(Homo sapiens (Human))
Kaken Pharmaceutical
Curated by ChEMBL
LigandPNGBDBM50068285(CHEMBL3403372)
Affinity DataIC50:  2.70nM. Assay description: Inhibition of human PDE7A expressed in insect cells assessed as inhibition of [3H]cAMP to [3H]AMP hydrolysis after 30 mins by scintillation counting
In DepthDetails ArticlePubMed
TargetcGMP-specific 3',5'-cyclic phosphodiesterase(Homo sapiens (Human))
Kaken Pharmaceutical
Curated by ChEMBL
LigandPNGBDBM50068285(CHEMBL3403372)
Affinity DataIC50:  3.00E+3nM. Assay description: Inhibition of PDE5A (unknown origin)
In DepthDetails ArticlePubMed
TargetcGMP-inhibited 3',5'-cyclic phosphodiesterase 3A(Homo sapiens (Human))
Kaken Pharmaceutical
Curated by ChEMBL
LigandPNGBDBM50068285(CHEMBL3403372)
Affinity DataIC50:  3.30E+3nM. Assay description: Inhibition of PDE3A (unknown origin)
In DepthDetails ArticlePubMed
TargetcAMP-specific 3',5'-cyclic phosphodiesterase 4B(Homo sapiens (Human))
Kaken Pharmaceutical
Curated by ChEMBL
LigandPNGBDBM50068285(CHEMBL3403372)
Affinity DataIC50:  200nM. Assay description: Inhibition of human PDE4B expressed in insect cells assessed as inhibition of [3H]cAMP to [3H]AMP hydrolysis after 30 mins by scintillation counting
In DepthDetails ArticlePubMed