BDBM50069477 CHEMBL540332::N-(7-Bromo-2,3-dioxo-1,2,3,4-tetrahydro-quinoxalin-5-ylmethyl)-6-methyl-nicotinamide; hydrochloride
SMILES Cc1ccc(cn1)C(=O)NCc1cc(Br)cc2[nH]c(=O)c(=O)[nH]c12
InChI Key InChIKey=JBVBWNTZKGKTDE-UHFFFAOYSA-N
Data  1 IC50
  Tab Delimited (TSV)   2D SDfile   Computed 3D by Vconf -m prep SDfile
Find this compound or compounds like it in BindingDB:
Activity Spreadsheet -- Enzyme Inhibition Constant Data from BindingDB
Found 1 hit for monomerid = 50069477
TargetGlutamate receptor ionotropic, NMDA 1(RAT)
Novartis Pharma
Curated by ChEMBL
LigandPNGBDBM50069477(CHEMBL540332 | N-(7-Bromo-2,3-dioxo-1,2,3,4-tetrah...)
Affinity DataIC50:  110nM. Assay description: In vitro binding assay for the displacement of [3H]MDL-105519 from the glycine-site of NMDA receptors
In DepthDetails ArticlePubMed