BDBM50071828 Benzenesulfonic acid (3R,5S)-1-benzenesulfonyl-5-((S)-1-benzyl-2-oxo-ethylcarbamoyl)-pyrrolidin-3-yl ester::CHEMBL87146
SMILES O=C[C@H](Cc1ccccc1)NC(=O)[C@@H]1C[C@H](CN1S(=O)(=O)c1ccccc1)OS(=O)(=O)c1ccccc1
InChI Key InChIKey=UZISLNFABGKCDY-FBLLAGFSSA-N
Data  2 IC50
  Tab Delimited (TSV)   2D SDfile   Computed 3D by Vconf -m prep SDfile
Find this compound or compounds like it in BindingDB:
Activity Spreadsheet -- Enzyme Inhibition Constant Data from BindingDB
Found 2 hits for monomerid = 50071828
TargetCalpain-1 catalytic subunit(Homo sapiens (Human))
Cephalon
Curated by ChEMBL
LigandPNGBDBM50071828(Benzenesulfonic acid (3R,5S)-1-benzenesulfonyl-5-(...)
Affinity DataIC50:  13nM. Assay description: Compound was tested for inhibitory activity against recombinant human Calpain 1
In DepthDetails ArticlePubMed
TargetCathepsin B(Homo sapiens (Human))
Cephalon
Curated by ChEMBL
LigandPNGBDBM50071828(Benzenesulfonic acid (3R,5S)-1-benzenesulfonyl-5-(...)
Affinity DataIC50:  38nM. Assay description: Compound was tested for inhibitory activity against Cathepsin B.
In DepthDetails ArticlePubMed