BDBM50071986 10-Fluoro-1,3,3-trimethyl-4,11-dihydro-3H-indeno[2,1-f]quinoline::CHEMBL91927
SMILES CC1=CC(C)(C)Nc2ccc-3c(Cc4c-3cccc4F)c12
InChI Key InChIKey=DQOHITXSZLLWAT-UHFFFAOYSA-N
Data  2 KI  1 IC50
  Tab Delimited (TSV)   2D SDfile   Computed 3D by Vconf -m prep SDfile
Find this compound or compounds like it in BindingDB:
Activity Spreadsheet -- Enzyme Inhibition Constant Data from BindingDB
Found 2 hits for monomerid = 50071986
TargetProgesterone receptor(Homo sapiens (Human))
Ligand Pharmaceuticals
Curated by ChEMBL
LigandPNGBDBM50071986(10-Fluoro-1,3,3-trimethyl-4,11-dihydro-3H-indeno[2...)
Affinity DataKi:  16nM. Assay description: Binding affinity against human progesterone receptor-A (hPR-A)
In DepthDetails ArticlePubMed
TargetProgesterone receptor(Homo sapiens (Human))
Ligand Pharmaceuticals
Curated by ChEMBL
LigandPNGBDBM50071986(10-Fluoro-1,3,3-trimethyl-4,11-dihydro-3H-indeno[2...)
Affinity DataIC50:  496nM. Assay description: Antagonist activity against human progesterone receptor B (hPR-B) in cotransfected CV-1 cells
In DepthDetails ArticlePubMed