BDBM50072437 CHEMBL105121::{(3-Carbamimidoyl-phenyl)-[2-(2'-sulfamoyl-biphenyl-4-yl)-ethyl]-amino}-acetic acid methyl ester; TFA
SMILES COC(=O)CN(CCc1ccc(cc1)-c1ccccc1S(N)(=O)=O)c1cccc(c1)C(N)=N
InChI Key InChIKey=LCHFBKHDAWJSLO-UHFFFAOYSA-N
Data  3 KI
  Tab Delimited (TSV)   2D SDfile   Computed 3D by Vconf -m prep SDfile
Find this compound or compounds like it in BindingDB:
Activity Spreadsheet -- Enzyme Inhibition Constant Data from BindingDB
Found 3 hits for monomerid = 50072437
TargetCoagulation factor X(Oryctolagus cuniculus)
Dupont Pharmaceuticals
Curated by ChEMBL
LigandPNGBDBM50072437(CHEMBL105121 | {(3-Carbamimidoyl-phenyl)-[2-(2'-su...)
Affinity DataKi:  10nM. Assay description: Inhibition of serine protease factor Xa enzyme.
In DepthDetails ArticlePubMed
TargetTrypsin(Homo sapiens (Human))
Dupont Pharmaceuticals
Curated by ChEMBL
LigandPNGBDBM50072437(CHEMBL105121 | {(3-Carbamimidoyl-phenyl)-[2-(2'-su...)
Affinity DataKi:  56nM. Assay description: Inhibition of serine protease trypsin enzyme.
In DepthDetails ArticlePubMed
TargetProthrombin(Homo sapiens (Human))
Dupont Pharmaceuticals
Curated by ChEMBL
LigandPNGBDBM50072437(CHEMBL105121 | {(3-Carbamimidoyl-phenyl)-[2-(2'-su...)
Affinity DataKi:  400nM. Assay description: Inhibition of serine protease thrombin enzyme.
In DepthDetails ArticlePubMed