BDBM50074144 CHEMBL3409901
SMILES CC(C)C[C@H](NC(=O)[C@H](CC(C)C)NC(=O)N1CCOCC1)C(=O)N[C@@H](Cc1c[nH]c2ccccc12)C(=O)N1CCC[C@H]1COc1ccc(F)cc1
InChI Key
Data  1 KI
  Tab Delimited (TSV)   2D SDfile   Computed 3D by Vconf -m prep SDfile
Find this compound or compounds like it in BindingDB:
Activity Spreadsheet -- Enzyme Inhibition Constant Data from BindingDB
Found 1 hit for monomerid = 50074144
TargetFalcipain 2(Plasmodium falciparum)
University Of Toronto
Curated by ChEMBL
LigandPNGBDBM50074144(CHEMBL3409901)
Affinity DataKi:  400nM. Assay description: Inhibition of Plasmodium falciparum recombinant falcipain-2 using ZFR-AMC as substrate after 30 mins by fluorometric assay
In DepthDetails ArticlePubMed