BDBM50078307 2-Cyano-N-[(1R,2S)-2-(2-cyano-phenoxy)-1-methyl-2-phenyl-ethyl]-3,3-dimethyl-butyramide::CHEMBL418515
SMILES C[C@@H](NC(=O)C(C#N)C(C)(C)C)[C@@H](Oc1ccccc1C#N)c1ccccc1
InChI Key InChIKey=VMJXEHMUZRVZCG-SVAIFQIPSA-N
Data  1 KI
  Tab Delimited (TSV)   2D SDfile   Computed 3D by Vconf -m prep SDfile
Find this compound or compounds like it in BindingDB:
Activity Spreadsheet -- Enzyme Inhibition Constant Data from BindingDB
Found 1 hit for monomerid = 50078307
TargetScytalone dehydratase(Magnaporthe grisea)
Fmc Stine Research Center
Curated by ChEMBL
LigandPNGBDBM50078307(2-Cyano-N-[(1R,2S)-2-(2-cyano-phenoxy)-1-methyl-2-...)
Affinity DataKi:  0.140nM. Assay description: Inhibition of scytalone dehydratase purified from Magnaporthe grisea
In DepthDetails ArticlePubMed