BDBM50079411 Asp-Thr-p-NO2-Phe-Val-Gly-Leu-Nle-NH2::CHEMBL430650
SMILES CC(C)CC[C@H](NC(=O)[C@H](CC(C)C)NC(=O)CNC(=O)[C@@H](NC(=O)[C@H](Cc1ccc(cc1)[N+]([O-])=O)NC(=O)[C@@H](NC(=O)[C@@H](N)CC(O)=O)[C@@H](C)O)C(C)C)C(N)=O
InChI Key InChIKey=RZBJNEWMGZLTHV-VPFUYYLISA-N
Data  1 KI
  Tab Delimited (TSV)   2D SDfile   Computed 3D by Vconf -m prep SDfile
Find this compound or compounds like it in BindingDB:
Activity Spreadsheet -- Enzyme Inhibition Constant Data from BindingDB
Found 1 hit for monomerid = 50079411
TargetSubstance-K receptor(Homo sapiens (Human))
Creighton University School Of Medicine
Curated by ChEMBL
LigandPNGBDBM50079411(Asp-Thr-p-NO2-Phe-Val-Gly-Leu-Nle-NH2 | CHEMBL4306...)
Affinity DataKi: >2.00E+3nM. Assay description: The compound was tested for competition binding with [3H]NKA against the CHO cells from cloned human Tachykinin receptor 2
In DepthDetails ArticlePubMed