BDBM50080461 17-(Cyclopropyl-methyl) -6, 7-didehydro-3,14-dihydroxy-4,5alpha-epoxy-2'-methyl-6'-phenylpyrimido-[4',5':6,7]morphinan::CHEMBL333393
SMILES Cc1nc2C3Oc4c5c(C[C@H]6N(CC7CC7)CC[C@@]35[C@@]6(O)Cc2c(n1)-c1ccccc1)ccc4O
InChI Key InChIKey=ZNRRBJWDMTUOSW-QLVNZVBKSA-N
Data  3 KI
  Tab Delimited (TSV)   2D SDfile   Computed 3D by Vconf -m prep SDfile
Find this compound or compounds like it in BindingDB:
Activity Spreadsheet -- Enzyme Inhibition Constant Data from BindingDB
Found 3 hits for monomerid = 50080461
TargetMu-type opioid receptor(Rattus norvegicus (rat))
Southern Research Institute
Curated by ChEMBL
LigandPNGBDBM50080461(17-(Cyclopropyl-methyl) -6, 7-didehydro-3,14-dihyd...)
Affinity DataKi:  254nM. Assay description: Binding affinity for Opioid receptor mu 1 was determined by inhibition of binding of [3H]DAMGO (1.4-3 nM) to rat brain membranes
In DepthDetails ArticlePubMed
TargetDelta-type opioid receptor(Rattus norvegicus (rat))
Southern Research Institute
Curated by ChEMBL
LigandPNGBDBM50080461(17-(Cyclopropyl-methyl) -6, 7-didehydro-3,14-dihyd...)
Affinity DataKi:  325nM. Assay description: Binding affinity for Opioid receptor delta 1 was determined by inhibition of binding of [3H]DADLE (1.3-2.0 nM) to rat brain membranes
In DepthDetails ArticlePubMed
TargetKappa-type opioid receptor(Cavia porcellus (domestic guinea pig))
Southern Research Institute
Curated by ChEMBL
LigandPNGBDBM50080461(17-(Cyclopropyl-methyl) -6, 7-didehydro-3,14-dihyd...)
Affinity DataKi:  565nM. Assay description: Binding affinity for Opioid receptor kappa 1 was determined by inhibition of binding of [3H]U-69593 (1.2-2.2 nM) to guinea pig brain membranes
In DepthDetails ArticlePubMed