BDBM50081697 6-Chloro-3-(3-cyclohexyl-propyl)-pyran-2-one::CHEMBL336175
SMILES Clc1ccc(CCCC2CCCCC2)c(=O)o1
InChI Key InChIKey=KIDVWGSJRZRWEU-UHFFFAOYSA-N
Data  1 KI
  Tab Delimited (TSV)   2D SDfile   Computed 3D by Vconf -m prep SDfile
Find this compound or compounds like it in BindingDB:
Activity Spreadsheet -- Enzyme Inhibition Constant Data from BindingDB
Found 1 hit for monomerid = 50081697
TargetBile salt-activated lipase(Homo sapiens (Human))
University Of New Mexico
Curated by ChEMBL
LigandPNGBDBM50081697(6-Chloro-3-(3-cyclohexyl-propyl)-pyran-2-one | CHE...)
Affinity DataKi:  60nM. Assay description: Inhibition of the Pancreatic Cholesterol Esterase from porcine
In DepthDetails ArticlePubMed