BDBM50082039 CHEMBL3422398
SMILES Br.NCCCn1c2-c3cc(O)ccc3C(=O)c2c2ccc(cc2c1=O)[N+]([O-])=O
InChI Key InChIKey=OKJDLRMQHZRYOZ-UHFFFAOYSA-N
Data  1 IC50
  Tab Delimited (TSV)   2D SDfile   Computed 3D by Vconf -m prep SDfile
Find this compound or compounds like it in BindingDB:
Activity Spreadsheet -- Enzyme Inhibition Constant Data from BindingDB
Found 1 hit for monomerid = 50082039
TargetTyrosyl-DNA phosphodiesterase 1(Homo sapiens (Human))
Purdue University
Curated by ChEMBL
LigandPNGBDBM50082039(CHEMBL3422398)
Affinity DataIC50:  1.00E+3nM. Assay description: Inhibition of human recombinant TDP1 assessed as hydrolysis of N14Y to N14P after 15 mins by PAGE analysis
In DepthDetails ArticlePubMed