BDBM50083953 (Z)-4-(3-Bromo-phenyl)-2-hydroxy-4-oxo-but-2-enoic acid::4-(3-Bromo-phenyl)-2-hydroxy-4-oxo-but-2-enoic acid::4-(3-Bromo-phenyl)-2-hydroxy-4-oxo-but-2-enoic acid (0.35H2O)::CHEMBL22197::Sacchettini_7
SMILES OC(=O)C(=O)CC(=O)c1cccc(Br)c1
InChI Key InChIKey=DLBFPLZJXXVHIG-UHFFFAOYSA-N
Data  6 IC50
PDB links: 1 PDB ID matches this monomer.
  Tab Delimited (TSV)   2D SDfile   Computed 3D by Vconf -m prep SDfile
Find this compound or compounds like it in BindingDB:
Activity Spreadsheet -- Enzyme Inhibition Constant Data from BindingDB
Found 3 hits for monomerid = 50083953
TargetIntegrase(Human immunodeficiency virus 1)
National Cancer Institute/Nih
Curated by ChEMBL
LigandPNGBDBM50083953((Z)-4-(3-Bromo-phenyl)-2-hydroxy-4-oxo-but-2-enoic...)
Affinity DataIC50:  3.00E+3nM. Assay description: Inhibitory effect on strand transfer of proviral DNA into host DNA in an extracellular HIV-1 integrase assay in experiment 2
In DepthDetails ArticlePubMed
TargetIntegrase(Human immunodeficiency virus 1)
National Cancer Institute/Nih
Curated by ChEMBL
LigandPNGBDBM50083953((Z)-4-(3-Bromo-phenyl)-2-hydroxy-4-oxo-but-2-enoic...)
Affinity DataIC50:  2.00E+3nM. Assay description: Inhibitory effect on strand transfer of proviral DNA into host DNA in an extracellular HIV-1 integrase assay in experiment 1
In DepthDetails ArticlePubMed
TargetIntegrase(Human immunodeficiency virus 1)
National Cancer Institute/Nih
Curated by ChEMBL
LigandPNGBDBM50083953((Z)-4-(3-Bromo-phenyl)-2-hydroxy-4-oxo-but-2-enoic...)
Affinity DataIC50: >1.00E+5nM. Assay description: Inhibitory effect on 3'-processing(3'-P) of proviral DNA in an extracellular HIV-1 integrase assay
In DepthDetails ArticlePubMed