BDBM50085918 7-[3,5-Dihydroxy-2-(3-hydroxy-4-m-tolylsulfanyl-butyl)-cyclopentyl]-heptanoic acid::CHEMBL176692
SMILES Cc1cccc(SCC(O)CC[C@H]2[C@H](O)C[C@H](O)[C@@H]2CCCCCCC(O)=O)c1
InChI Key InChIKey=JQFLCIIQNZIBOE-ONFJWMFVSA-N
Data  8 IC50
  Tab Delimited (TSV)   2D SDfile   Computed 3D by Vconf -m prep SDfile
Find this compound or compounds like it in BindingDB:
Activity Spreadsheet -- Enzyme Inhibition Constant Data from BindingDB
Found 8 hits for monomerid = 50085918
TargetProstaglandin E2 receptor EP2 subtype(Homo sapiens (Human))
Procter And Gamble Pharmaceuticals
Curated by ChEMBL
LigandPNGBDBM50085918(7-[3,5-Dihydroxy-2-(3-hydroxy-4-m-tolylsulfanyl-bu...)
Affinity DataIC50: >1.00E+4nM. Assay description: Affinity for Prostanoid EP2 receptor expressed in CHO cells
In DepthDetails ArticlePubMed
TargetProstaglandin E2 receptor EP4 subtype(Homo sapiens (Human))
Procter And Gamble Pharmaceuticals
Curated by ChEMBL
LigandPNGBDBM50085918(7-[3,5-Dihydroxy-2-(3-hydroxy-4-m-tolylsulfanyl-bu...)
Affinity DataIC50: >1.00E+4nM. Assay description: Affinity for Prostanoid EP4 receptor expressed in CHO cells
In DepthDetails ArticlePubMed
TargetProstaglandin E2 receptor EP3 subtype(Homo sapiens (Human))
Procter And Gamble Pharmaceuticals
Curated by ChEMBL
LigandPNGBDBM50085918(7-[3,5-Dihydroxy-2-(3-hydroxy-4-m-tolylsulfanyl-bu...)
Affinity DataIC50: >1.00E+4nM. Assay description: Affinity for Prostanoid EP3 receptor expressed in CHO cell line
In DepthDetails ArticlePubMed
TargetThromboxane A2 receptor(Homo sapiens (Human))
Procter And Gamble Pharmaceuticals
Curated by ChEMBL
LigandPNGBDBM50085918(7-[3,5-Dihydroxy-2-(3-hydroxy-4-m-tolylsulfanyl-bu...)
Affinity DataIC50: >1.00E+4nM. Assay description: Affinity for Prostanoid TP receptor expressed in CHO cells
In DepthDetails ArticlePubMed
TargetProstaglandin D2 receptor(Homo sapiens (Human))
Procter And Gamble Pharmaceuticals
Curated by ChEMBL
LigandPNGBDBM50085918(7-[3,5-Dihydroxy-2-(3-hydroxy-4-m-tolylsulfanyl-bu...)
Affinity DataIC50: >1.00E+4nM. Assay description: Affinity for human Prostaglandin D2 receptor expressed in HEK-293 cells
In DepthDetails ArticlePubMed
TargetProstaglandin E2 receptor EP1 subtype(Homo sapiens (Human))
Procter And Gamble Pharmaceuticals
Curated by ChEMBL
LigandPNGBDBM50085918(7-[3,5-Dihydroxy-2-(3-hydroxy-4-m-tolylsulfanyl-bu...)
Affinity DataIC50:  4.60E+3nM. Assay description: Affinity for Prostanoid EP1 receptor expressed in COS-7 cells.
In DepthDetails ArticlePubMed
TargetProstaglandin F2-alpha receptor(Homo sapiens (Human))
Procter And Gamble Pharmaceuticals
Curated by ChEMBL
LigandPNGBDBM50085918(7-[3,5-Dihydroxy-2-(3-hydroxy-4-m-tolylsulfanyl-bu...)
Affinity DataIC50:  63nM. Assay description: Affinity for human Prostanoid FP receptor expressed in COS-7 cells
In DepthDetails ArticlePubMed
TargetProstacyclin receptor(Homo sapiens (Human))
Procter And Gamble Pharmaceuticals
Curated by ChEMBL
LigandPNGBDBM50085918(7-[3,5-Dihydroxy-2-(3-hydroxy-4-m-tolylsulfanyl-bu...)
Affinity DataIC50: >1.00E+4nM. Assay description: Affinity for Prostaglandin I2 receptor expressed in CHO cells
In DepthDetails ArticlePubMed