BDBM50085928 CHEMBL3425593
SMILES NC(=O)C[C@H](NC(=O)[C@H](CCCNC(N)=N)NC(=O)[C@@H]1CCCN1C(=O)[C@H](CCCNC(N)=N)NC(=O)[C@H](Cc1ccc(F)cc1)NC(=O)[C@H](Cc1c[nH]c2ccccc12)NC(=O)Cc1cccs1)C(N)=O
InChI Key InChIKey=TZCCKCLHNUSAMQ-DUGSHLAESA-N
Data  2 EC50
  Tab Delimited (TSV)   2D SDfile   Computed 3D by Vconf -m prep SDfile
Find this compound or compounds like it in BindingDB:
Activity Spreadsheet -- Enzyme Inhibition Constant Data from BindingDB
Found 2 hits for monomerid = 50085928
TargetNeuromedin-U receptor 1(Homo sapiens (Human))
Tokyo University Of Pharmacy And Life Sciences
Curated by ChEMBL
LigandPNGBDBM50085928(CHEMBL3425593)
Affinity DataEC50:  0.0830nM. Assay description: Agonist activity at human NMUR1 expressed in CHO cells assessed as intracellular calcium flux at by Fluo-4 AM dye based fluorometric imaging method
In DepthDetails ArticlePubMed
TargetNeuromedin-U receptor 2(Homo sapiens (Human))
Tokyo University Of Pharmacy And Life Sciences
Curated by ChEMBL
LigandPNGBDBM50085928(CHEMBL3425593)
Affinity DataEC50:  2.60nM. Assay description: Agonist activity at human NMUR2 expressed in CHO cells assessed as intracellular calcium flux at by Fluo-4 AM dye based fluorometric imaging method
In DepthDetails ArticlePubMed