BDBM50086115 5-[4-(5-fluoro-1H-3-indolyl)hexahydro-1-pyridinylcarboxamido]-1'-methylspiro[2,3-dihydrobenzo[b]furan-3,4'-(hexahydropyridine)]::CHEMBL276928
SMILES CN1CCC2(COc3ccc(NC(=O)N4CCC(CC4)c4c[nH]c5ccc(F)cc45)cc23)CC1
InChI Key InChIKey=HIBNGDNAJQHLGU-UHFFFAOYSA-N
Data  3 IC50
  Tab Delimited (TSV)   2D SDfile   Computed 3D by Vconf -m prep SDfile
Find this compound or compounds like it in BindingDB:
Activity Spreadsheet -- Enzyme Inhibition Constant Data from BindingDB
Found 3 hits for monomerid = 50086115
Target5-hydroxytryptamine receptor 1A(Rattus norvegicus (rat))
Merck
Curated by ChEMBL
LigandPNGBDBM50086115(5-[4-(5-fluoro-1H-3-indolyl)hexahydro-1-pyridinylc...)
Affinity DataIC50: >200nM. Assay description: Binding affinity towards 5-hydroxytryptamine 1A receptor in rat frontal cortex using [125I]-iodocyanopindolol as radio-ligand.
In DepthDetails ArticlePubMed
Target5-hydroxytryptamine receptor 1D(RAT)
Merck
Curated by ChEMBL
LigandPNGBDBM50086115(5-[4-(5-fluoro-1H-3-indolyl)hexahydro-1-pyridinylc...)
Affinity DataIC50:  900nM. Assay description: Binding affinity towards 5-hydroxytryptamine 1D receptor in rat frontal cortex using [125I]-iodocyanopindolol as radio-ligand.
In DepthDetails ArticlePubMed
Target5-hydroxytryptamine receptor 1B(Rattus norvegicus (Rat))
Merck
Curated by ChEMBL
LigandPNGBDBM50086115(5-[4-(5-fluoro-1H-3-indolyl)hexahydro-1-pyridinylc...)
Affinity DataIC50:  23nM. Assay description: Binding affinity towards 5-hydroxytryptamine 1B receptor in rat frontal cortex using [125I]-iodocyanopindolol as radio-ligand.
In DepthDetails ArticlePubMed