BDBM50086117 1-{2-[4-(6-fluoro-1H-indol-3-yl)piperidin-1yl]ethyl}-[2,3-Dihydro-1'-methylspiro(benzofuran-3,4'-piperidine)]-amide::CHEMBL15909
SMILES CN1CCC2(COc3ccc(NC(=O)NCCN4CCC(CC4)c4c[nH]c5cc(F)ccc45)cc23)CC1
InChI Key InChIKey=HCDXKCGDMXPSKS-UHFFFAOYSA-N
Data  3 IC50
  Tab Delimited (TSV)   2D SDfile   Computed 3D by Vconf -m prep SDfile
Find this compound or compounds like it in BindingDB:
Activity Spreadsheet -- Enzyme Inhibition Constant Data from BindingDB
Found 3 hits for monomerid = 50086117
Target5-hydroxytryptamine receptor 1A(Rattus norvegicus (rat))
Merck
Curated by ChEMBL
LigandPNGBDBM50086117(1-{2-[4-(6-fluoro-1H-indol-3-yl)piperidin-1yl]ethy...)
Affinity DataIC50:  700nM. Assay description: Binding affinity towards 5-hydroxytryptamine 1A receptor in rat frontal cortex using [125I]-iodocyanopindolol as radio-ligand.
In DepthDetails ArticlePubMed
Target5-hydroxytryptamine receptor 1B(Rattus norvegicus (Rat))
Merck
Curated by ChEMBL
LigandPNGBDBM50086117(1-{2-[4-(6-fluoro-1H-indol-3-yl)piperidin-1yl]ethy...)
Affinity DataIC50:  300nM. Assay description: Binding affinity towards 5-hydroxytryptamine 1B receptor in rat frontal cortex using [125I]-iodocyanopindolol as radio-ligand.
In DepthDetails ArticlePubMed
Target5-hydroxytryptamine receptor 1D(RAT)
Merck
Curated by ChEMBL
LigandPNGBDBM50086117(1-{2-[4-(6-fluoro-1H-indol-3-yl)piperidin-1yl]ethy...)
Affinity DataIC50:  900nM. Assay description: Binding affinity towards 5-hydroxytryptamine 1D receptor in rat frontal cortex using [125I]-iodocyanopindolol as radio-ligand.
In DepthDetails ArticlePubMed