BDBM50087327 6-(8-Hydroxy-7,8-dihydro-6H-imidazo[4,5-d][1,3]diazepin-3-yl)-2-phenyl-hexanoic acid ethyl ester::CHEMBL288266
SMILES CCOC(=O)C(CCCCn1cnc2C(O)CNC=Nc12)c1ccccc1
InChI Key InChIKey=SFSXDAXQZZUSLZ-UHFFFAOYSA-N
Data  2 KI
  Tab Delimited (TSV)   2D SDfile   Computed 3D by Vconf -m prep SDfile
Find this compound or compounds like it in BindingDB:
Activity Spreadsheet -- Enzyme Inhibition Constant Data from BindingDB
Found 2 hits for monomerid = 50087327
TargetAdenosine deaminase(Bos taurus (bovine))
Metabasis Therapeutics
Curated by ChEMBL
LigandPNGBDBM50087327(6-(8-Hydroxy-7,8-dihydro-6H-imidazo[4,5-d][1,3]dia...)
Affinity DataKi: >7.50E+3nM. Assay description: Evaluated for the inhibition of calf intestinal Adenosine deaminase (ADA)
In DepthDetails ArticlePubMed
TargetAMP deaminase 2(Homo sapiens (Human))
Metabasis Therapeutics
Curated by ChEMBL
LigandPNGBDBM50087327(6-(8-Hydroxy-7,8-dihydro-6H-imidazo[4,5-d][1,3]dia...)
Affinity DataKi:  9.60E+3nM. Assay description: Evaluated for the inhibition of porcine heart or human L-type Adenosine 5'-monophosphate deaminase (AMPDA)
In DepthDetails ArticlePubMed