BDBM50089626 3,6-Dihydroxy-4-hydroxymethyl-4,6a,12b-trimethyl-9-phenyl-1,2,3,4,4a,5,6,6a,12a,12b-decahydro-7,10-dioxa-benzo[a]anthracene-11,12-dione::CHEMBL277665
SMILES CC1(CO)[C@@H](O)CC[C@@]2(C)C1C[C@H](O)[C@@]1(C)Oc3cc(oc(=O)c3C(=O)C21)-c1ccccc1
InChI Key InChIKey=WFDQGTRGUDCCLC-FDERJZKESA-N
Data  1 IC50
  Tab Delimited (TSV)   2D SDfile   Computed 3D by Vconf -m prep SDfile
Find this compound or compounds like it in BindingDB:
Activity Spreadsheet -- Enzyme Inhibition Constant Data from BindingDB
Found 1 hit for monomerid = 50089626
TargetAcetylcholinesterase(Homo sapiens (Human))
Kitasato University
Curated by ChEMBL
LigandPNGBDBM50089626(3,6-Dihydroxy-4-hydroxymethyl-4,6a,12b-trimethyl-9...)
Affinity DataIC50:  9.90E+4nM. Assay description: Inhibitory activity against Acetylcholinesterase
In DepthDetails ArticlePubMed