BDBM50090224 CHEMBL289493::MD805 Analogue
SMILES CC1CNc2c(C1)cccc2S(=O)(=O)N[C@@H](Cc1nc2ccccc2o1)C(=O)N1CCC(CCO)CC1
InChI Key InChIKey=CBZHMZQAEBODOA-YSYXNDDBSA-N
Data  1 KI
  Tab Delimited (TSV)   2D SDfile   Computed 3D by Vconf -m prep SDfile
Find this compound or compounds like it in BindingDB:
Activity Spreadsheet -- Enzyme Inhibition Constant Data from BindingDB
Found 1 hit for monomerid = 50090224
TargetProthrombin(Homo sapiens (Human))
Novartis Horsham Research Centre
Curated by ChEMBL
LigandPNGBDBM50090224(CHEMBL289493 | MD805 Analogue)
Affinity DataKi:  3.10E+3nM. Assay description: Compound was evaluated for its inhibitory activity against Thrombin
In DepthDetails ArticlePubMed