BDBM50090225 3-Methyl-1,2,3,4-tetrahydro-quinoline-8-sulfonic acid {(S)-1-benzyl-2-[4-(2-hydroxy-ethyl)-piperidin-1-yl]-2-oxo-ethyl}-amide::CHEMBL290883
SMILES CC1CNc2c(C1)cccc2S(=O)(=O)N[C@@H](Cc1ccccc1)C(=O)N1CCC(CCO)CC1
InChI Key InChIKey=TZRLMHNTMLSNAP-BVHINDKJSA-N
Data  1 KI
  Tab Delimited (TSV)   2D SDfile   Computed 3D by Vconf -m prep SDfile
Find this compound or compounds like it in BindingDB:
Activity Spreadsheet -- Enzyme Inhibition Constant Data from BindingDB
Found 1 hit for monomerid = 50090225
TargetProthrombin(Homo sapiens (Human))
Novartis Horsham Research Centre
Curated by ChEMBL
LigandPNGBDBM50090225(3-Methyl-1,2,3,4-tetrahydro-quinoline-8-sulfonic a...)
Affinity DataKi:  6.70E+3nM. Assay description: Compound was evaluated for its inhibitory activity against Thrombin
In DepthDetails ArticlePubMed