BDBM50090228 CHEMBL289628::MD805 Analogue
SMILES CC1(C)CNc2c(C1)cccc2S(=O)(=O)NC(Cc1nc2cncnc2s1)C(=O)N1CCC(CCF)CC1
InChI Key InChIKey=FPHXKNOKCOMNSP-UHFFFAOYSA-N
Data  1 KI
  Tab Delimited (TSV)   2D SDfile   Computed 3D by Vconf -m prep SDfile
Find this compound or compounds like it in BindingDB:
Activity Spreadsheet -- Enzyme Inhibition Constant Data from BindingDB
Found 1 hit for monomerid = 50090228
TargetProthrombin(Homo sapiens (Human))
Novartis Horsham Research Centre
Curated by ChEMBL
LigandPNGBDBM50090228(CHEMBL289628 | MD805 Analogue)
Affinity DataKi:  4.56E+3nM. Assay description: Compound was evaluated for its inhibitory activity against Thrombin
In DepthDetails ArticlePubMed