BDBM50090230 CHEMBL38617::MD805 Analogue
SMILES Cc1csc(CC(NS(=O)(=O)c2cccc3CC(C)(C)CNc23)C(=O)N2CCC(CCO)CC2)n1
InChI Key InChIKey=LWJIZXMIKKRPQT-UHFFFAOYSA-N
Data  1 KI
  Tab Delimited (TSV)   2D SDfile   Computed 3D by Vconf -m prep SDfile
Find this compound or compounds like it in BindingDB:
Activity Spreadsheet -- Enzyme Inhibition Constant Data from BindingDB
Found 1 hit for monomerid = 50090230
TargetProthrombin(Homo sapiens (Human))
Novartis Horsham Research Centre
Curated by ChEMBL
LigandPNGBDBM50090230(CHEMBL38617 | MD805 Analogue)
Affinity DataKi:  2.19E+3nM. Assay description: Compound was evaluated for its inhibitory activity against Thrombin
In DepthDetails ArticlePubMed