BDBM50096402 Asp-D-Glu-Leu-Glu-Cha-Cys::CHEMBL303541
SMILES CC(C)C[C@H](NC(=O)[C@@H](CCC(O)=O)NC(=O)[C@@H](N)CC(O)=O)C(=O)N[C@@H](CCC(O)=O)C(=O)N[C@@H](CC1CCCCC1)C(=O)N[C@@H](CS)C(O)=O
InChI Key InChIKey=ZFRKNLVWQDBGEY-ZKPZVSKHSA-N
Data  1 KI
  Tab Delimited (TSV)   2D SDfile   Computed 3D by Vconf -m prep SDfile
Find this compound or compounds like it in BindingDB:
Activity Spreadsheet -- Enzyme Inhibition Constant Data from BindingDB
Found 1 hit for monomerid = 50096402
TargetGenome polyprotein(Hepatitis C virus)
Uppsala University
Curated by ChEMBL
LigandPNGBDBM50096402(Asp-D-Glu-Leu-Glu-Cha-Cys | CHEMBL303541)
Affinity DataKi:  1.54E+3nM. Assay description: Inhibitory activity against hepatitis C virus (HCV) NS3 protease (full-length)
In DepthDetails ArticlePubMed