BDBM50096404 AcAsp-Glu-Leu-Glu-Cha-Cys::CHEMBL305570
SMILES CC(C)C[C@H](NC(=O)[C@H](CCC(O)=O)NC(=O)[C@H](CC(O)=O)NC(C)=O)C(=O)N[C@@H](CCC(O)=O)C(=O)N[C@@H](CC1CCCCC1)C(=O)N[C@@H](CS)C(O)=O
InChI Key InChIKey=SYHFABLPDKKGNQ-OOPVGHQCSA-N
Data  2 KI
  Tab Delimited (TSV)   2D SDfile   Computed 3D by Vconf -m prep SDfile
Find this compound or compounds like it in BindingDB:
Activity Spreadsheet -- Enzyme Inhibition Constant Data from BindingDB
Found 2 hits for monomerid = 50096404
TargetGenome polyprotein(Hepatitis C virus)
Uppsala University
Curated by ChEMBL
LigandPNGBDBM50096404(AcAsp-Glu-Leu-Glu-Cha-Cys | CHEMBL305570)
Affinity DataKi:  60nM. Assay description: Inhibitory activity against hepatitis C virus (HCV) NS3 protease (isolated domain)
In DepthDetails ArticlePubMed
TargetGenome polyprotein(Hepatitis C virus)
Uppsala University
Curated by ChEMBL
LigandPNGBDBM50096404(AcAsp-Glu-Leu-Glu-Cha-Cys | CHEMBL305570)
Affinity DataKi:  490nM. Assay description: Inhibitory activity against hepatitis C virus (HCV) NS3 protease (full-length)
In DepthDetails ArticlePubMed