BDBM50104062 4-Hydroxy-3-methoxy-benzoic acid (4-methoxy-benzylidene)-hydrazide::CHEMBL419181
SMILES COc1ccc(\C=N\NC(=O)c2ccc(O)c(OC)c2)cc1
InChI Key InChIKey=FOLCMUGNDQVRGT-LICLKQGHSA-N
Data  1 IC50
  Tab Delimited (TSV)   2D SDfile   Computed 3D by Vconf -m prep SDfile
Find this compound or compounds like it in BindingDB:
Activity Spreadsheet -- Enzyme Inhibition Constant Data from BindingDB
Found 1 hit for monomerid = 50104062
TargetGlucagon receptor(Homo sapiens (Human))
Pfizer
Curated by ChEMBL
LigandPNGBDBM50104062(4-Hydroxy-3-methoxy-benzoic acid (4-methoxy-benzyl...)
Affinity DataIC50: >1.00E+5nM. Assay description: Binding affinity for human Glucagon Receptor
In DepthDetails ArticlePubMed