BDBM50104075 4-Hydroxy-3-methoxy-benzoic acid (2,4-dioxo-1,2,3,4-tetrahydro-pyrimidin-5-ylmethylene)-hydrazide::CHEMBL107045
SMILES COc1cc(ccc1O)C(=O)NN=Cc1c[nH]c(=O)[nH]c1=O
InChI Key InChIKey=UVTLNJPVDUDGKZ-UHFFFAOYSA-N
Data  1 IC50
  Tab Delimited (TSV)   2D SDfile   Computed 3D by Vconf -m prep SDfile
Find this compound or compounds like it in BindingDB:
Activity Spreadsheet -- Enzyme Inhibition Constant Data from BindingDB
Found 1 hit for monomerid = 50104075
TargetGlucagon receptor(Homo sapiens (Human))
Pfizer
Curated by ChEMBL
LigandPNGBDBM50104075(4-Hydroxy-3-methoxy-benzoic acid (2,4-dioxo-1,2,3,...)
Affinity DataIC50: >1.00E+5nM. Assay description: Binding affinity for human Glucagon Receptor
In DepthDetails ArticlePubMed