BDBM50104076 CHEMBL107484::Quinoxaline-6-carboxylic acid (4-hydroxy-naphthalen-1-ylmethylene)-hydrazide
SMILES Oc1ccc(\C=N\NC(=O)c2ccc3nccnc3c2)c2ccccc12
InChI Key InChIKey=DAEGOQLEFUNRHM-FSJBWODESA-N
Data  1 IC50
  Tab Delimited (TSV)   2D SDfile   Computed 3D by Vconf -m prep SDfile
Find this compound or compounds like it in BindingDB:
Activity Spreadsheet -- Enzyme Inhibition Constant Data from BindingDB
Found 1 hit for monomerid = 50104076
TargetGlucagon receptor(Homo sapiens (Human))
Pfizer
Curated by ChEMBL
LigandPNGBDBM50104076(CHEMBL107484 | Quinoxaline-6-carboxylic acid (4-hy...)
Affinity DataIC50: >1.00E+5nM. Assay description: Binding affinity for human Glucagon Receptor
In DepthDetails ArticlePubMed