BDBM50104079 4-Hydroxy-3-methoxy-benzoic acid (4-isopropyl-benzylidene)-hydrazide::CHEMBL106320
SMILES COc1cc(ccc1O)C(=O)N\N=C\c1ccc(cc1)C(C)C
InChI Key InChIKey=XHALGCGPVIDYCD-YBFXNURJSA-N
Data  1 IC50
  Tab Delimited (TSV)   2D SDfile   Computed 3D by Vconf -m prep SDfile
Find this compound or compounds like it in BindingDB:
Activity Spreadsheet -- Enzyme Inhibition Constant Data from BindingDB
Found 1 hit for monomerid = 50104079
TargetGlucagon receptor(Homo sapiens (Human))
Pfizer
Curated by ChEMBL
LigandPNGBDBM50104079(4-Hydroxy-3-methoxy-benzoic acid (4-isopropyl-benz...)
Affinity DataIC50:  4.30E+4nM. Assay description: Binding affinity for human Glucagon Receptor
In DepthDetails ArticlePubMed