BDBM50104081 4-Hydroxy-3-methoxy-benzoic acid (4-methoxy-naphthalen-1-ylmethylene)-hydrazide::CHEMBL104338
SMILES COc1cc(ccc1O)C(=O)N\N=C\c1ccc(OC)c2ccccc12
InChI Key InChIKey=MQVSQHUQOOXBBV-CIAFOILYSA-N
Data  1 IC50
  Tab Delimited (TSV)   2D SDfile   Computed 3D by Vconf -m prep SDfile
Find this compound or compounds like it in BindingDB:
Activity Spreadsheet -- Enzyme Inhibition Constant Data from BindingDB
Found 1 hit for monomerid = 50104081
TargetGlucagon receptor(Homo sapiens (Human))
Pfizer
Curated by ChEMBL
LigandPNGBDBM50104081(4-Hydroxy-3-methoxy-benzoic acid (4-methoxy-naphth...)
Affinity DataIC50:  2.90E+3nM. Assay description: Binding affinity for human Glucagon Receptor
In DepthDetails ArticlePubMed