BDBM50104097 3-Chloro-4-hydroxy-5-methoxy-benzoic acid(4-hydroxy-naphthalen-1-ylmethylene)-hydrazide::CHEMBL106058
SMILES COc1cc(cc(Cl)c1O)C(=O)N\N=C\c1ccc(O)c2ccccc12
InChI Key InChIKey=MYQRAXRCIMUYRB-UFFVCSGVSA-N
Data  1 IC50
  Tab Delimited (TSV)   2D SDfile   Computed 3D by Vconf -m prep SDfile
Find this compound or compounds like it in BindingDB:
Activity Spreadsheet -- Enzyme Inhibition Constant Data from BindingDB
Found 1 hit for monomerid = 50104097
TargetGlucagon receptor(Homo sapiens (Human))
Pfizer
Curated by ChEMBL
LigandPNGBDBM50104097(3-Chloro-4-hydroxy-5-methoxy-benzoic acid(4-hydrox...)
Affinity DataIC50:  6.00E+4nM. Assay description: Binding affinity for human Glucagon Receptor
In DepthDetails ArticlePubMed