BDBM50104298 2-{[(Thiophen-2-ylmethyl)-amino]-methyl}-pyrrolidine-3,4-diol::CHEMBL84941
SMILES OC1CNC(CNCc2cccs2)C1O
InChI Key InChIKey=OKMVGPCMRNTUSN-UHFFFAOYSA-N
Data  2 KI  2 IC50
  Tab Delimited (TSV)   2D SDfile   Computed 3D by Vconf -m prep SDfile
Find this compound or compounds like it in BindingDB:
Activity Spreadsheet -- Enzyme Inhibition Constant Data from BindingDB
Found 4 hits for monomerid = 50104298
Targetalpha-1,2-Mannosidase(Glycine max)
Section De Chimie De L'Universit£
Curated by ChEMBL
LigandPNGBDBM50104298(2-{[(Thiophen-2-ylmethyl)-amino]-methyl}-pyrrolidi...)
Affinity DataKi:  2.60E+4nM. Assay description: Inhibitory activity towards Beta-Glucosidase from Caldocellum saccharol
In DepthDetails ArticlePubMed
Targetalpha-1,2-Mannosidase(Glycine max)
Section De Chimie De L'Universit£
Curated by ChEMBL
LigandPNGBDBM50104298(2-{[(Thiophen-2-ylmethyl)-amino]-methyl}-pyrrolidi...)
Affinity DataKi:  9.80E+4nM. Assay description: Inhibitory activity towards Alpha-mannosidase from Almond
In DepthDetails ArticlePubMed
Targetalpha-1,2-Mannosidase(Glycine max)
Section De Chimie De L'Universit£
Curated by ChEMBL
LigandPNGBDBM50104298(2-{[(Thiophen-2-ylmethyl)-amino]-methyl}-pyrrolidi...)
Affinity DataIC50:  3.50E+5nM. Assay description: Inhibitory activity towards Alpha-mannosidase from Almond
In DepthDetails ArticlePubMed
Targetalpha-1,2-Mannosidase(Glycine max)
Section De Chimie De L'Universit£
Curated by ChEMBL
LigandPNGBDBM50104298(2-{[(Thiophen-2-ylmethyl)-amino]-methyl}-pyrrolidi...)
Affinity DataIC50:  3.50E+5nM. Assay description: Inhibitory activity towards Alpha-mannosidase from Almond
In DepthDetails ArticlePubMed