BDBM50104765 CHEMBL3594153
SMILES [H][C@@]1(CC(=O)[C@@]2(C)C3=C(C(=O)C[C@]12C)[C@@]1(C)CCC(=O)[C@@](C)(COC(=O)C[C@@](C)(O)CC(O)=O)[C@]1([H])CC3=O)[C@H](C)CC\C=C(/C)C(O)=O
InChI Key InChIKey=UTHBIXXKXDUNGA-HNFDVGSYSA-N
Data  1 IC50
  Tab Delimited (TSV)   2D SDfile   Computed 3D by Vconf -m prep SDfile
Find this compound or compounds like it in BindingDB:
Activity Spreadsheet -- Enzyme Inhibition Constant Data from BindingDB
Found 1 hit for monomerid = 50104765
Target3-hydroxy-3-methylglutaryl-coenzyme A reductase(Sus scrofa)
Chinese Academy Of Sciences
Curated by ChEMBL
LigandPNGBDBM50104765(CHEMBL3594153)
Affinity DataIC50:  1.33E+4nM. Assay description: Inhibition of pig liver microsomes HMG-CoA reductase incubated for 5 mins in using HMG-CoA and NADPH by colorimetric method
In DepthDetails ArticlePubMed