BDBM50107970 5-Ethyl-6-[(2-methoxy-5-trifluoromethyl-phenylamino)-methyl]-pyrido[2,3-d]pyrimidine-2,4-diamine::CHEMBL148577
SMILES CCc1c(CNc2cc(ccc2OC)C(F)(F)F)cnc2nc(N)nc(N)c12
InChI Key InChIKey=BEAJEDLRWCEAET-UHFFFAOYSA-N
Data  2 IC50
  Tab Delimited (TSV)   2D SDfile   Computed 3D by Vconf -m prep SDfile
Find this compound or compounds like it in BindingDB:
Activity Spreadsheet -- Enzyme Inhibition Constant Data from BindingDB
Found 2 hits for monomerid = 50107970
TargetDihydrofolate reductase(Homo sapiens (Human))
Lindsley F. Kimball Research Institute
Curated by ChEMBL
LigandPNGBDBM50107970(5-Ethyl-6-[(2-methoxy-5-trifluoromethyl-phenylamin...)
Affinity DataIC50:  3.60nM. Assay description: Antimycobacterial activity against human dihydrofolate reductase (hDHFR)
In DepthDetails ArticlePubMed
TargetDihydrofolate reductase(Homo sapiens (Human))
Lindsley F. Kimball Research Institute
Curated by ChEMBL
LigandPNGBDBM50107970(5-Ethyl-6-[(2-methoxy-5-trifluoromethyl-phenylamin...)
Affinity DataIC50:  0.880nM. Assay description: Antimycobacterial activity against Mycobacterium avium complex diihydrofolate reductase (MAC DHFR)
In DepthDetails ArticlePubMed