BDBM50107978 6-[(3-Methoxy-biphenyl-4-ylamino)-methyl]-5-methyl-pyrido[2,3-d]pyrimidine-2,4-diamine::CHEMBL147504
SMILES COc1cc(ccc1NCc1cnc2nc(N)nc(N)c2c1C)-c1ccccc1
InChI Key InChIKey=LEJZWCKEJIXXFL-UHFFFAOYSA-N
Data  2 IC50
  Tab Delimited (TSV)   2D SDfile   Computed 3D by Vconf -m prep SDfile
Find this compound or compounds like it in BindingDB:
Activity Spreadsheet -- Enzyme Inhibition Constant Data from BindingDB
Found 2 hits for monomerid = 50107978
TargetDihydrofolate reductase(Homo sapiens (Human))
Lindsley F. Kimball Research Institute
Curated by ChEMBL
LigandPNGBDBM50107978(6-[(3-Methoxy-biphenyl-4-ylamino)-methyl]-5-methyl...)
Affinity DataIC50:  0.910nM. Assay description: Antimycobacterial activity against Mycobacterium avium complex diihydrofolate reductase (MAC DHFR)
In DepthDetails ArticlePubMed
TargetDihydrofolate reductase(Homo sapiens (Human))
Lindsley F. Kimball Research Institute
Curated by ChEMBL
LigandPNGBDBM50107978(6-[(3-Methoxy-biphenyl-4-ylamino)-methyl]-5-methyl...)
Affinity DataIC50:  68nM. Assay description: Antimycobacterial activity against human dihydrofolate reductase (hDHFR)
In DepthDetails ArticlePubMed