BDBM50107986 6-[(3-Methoxy-4-propoxy-phenylamino)-methyl]-5-methyl-pyrido[2,3-d]pyrimidine-2,4-diamine::CHEMBL151947
SMILES CCCOc1ccc(NCc2cnc3nc(N)nc(N)c3c2C)cc1OC
InChI Key InChIKey=DRXDVBBFZVLKSJ-UHFFFAOYSA-N
Data  2 IC50
  Tab Delimited (TSV)   2D SDfile   Computed 3D by Vconf -m prep SDfile
Find this compound or compounds like it in BindingDB:
Activity Spreadsheet -- Enzyme Inhibition Constant Data from BindingDB
Found 2 hits for monomerid = 50107986
TargetDihydrofolate reductase(Homo sapiens (Human))
Lindsley F. Kimball Research Institute
Curated by ChEMBL
LigandPNGBDBM50107986(6-[(3-Methoxy-4-propoxy-phenylamino)-methyl]-5-met...)
Affinity DataIC50:  15nM. Assay description: Antimycobacterial activity against human dihydrofolate reductase (hDHFR)
In DepthDetails ArticlePubMed
TargetDihydrofolate reductase(Homo sapiens (Human))
Lindsley F. Kimball Research Institute
Curated by ChEMBL
LigandPNGBDBM50107986(6-[(3-Methoxy-4-propoxy-phenylamino)-methyl]-5-met...)
Affinity DataIC50:  0.930nM. Assay description: Antimycobacterial activity against Mycobacterium avium complex diihydrofolate reductase (MAC DHFR)
In DepthDetails ArticlePubMed