BDBM50108717 1-[4-(4-Oxazolo[5,4-c]pyridin-2-yl-piperazin-1-yl)-pyrimidin-2-yl]-ethanol::CHEMBL348496
SMILES C[C@@H](O)c1nccc(n1)N1CCN(CC1)c1nc2ccncc2o1
InChI Key InChIKey=UWWBAIISPZUBBA-LLVKDONJSA-N
Data  1 IC50
  Tab Delimited (TSV)   2D SDfile   Computed 3D by Vconf -m prep SDfile
Find this compound or compounds like it in BindingDB:
Activity Spreadsheet -- Enzyme Inhibition Constant Data from BindingDB
Found 1 hit for monomerid = 50108717
TargetSorbitol dehydrogenase(Homo sapiens (Human))
Pfizer
Curated by ChEMBL
LigandPNGBDBM50108717(1-[4-(4-Oxazolo[5,4-c]pyridin-2-yl-piperazin-1-yl)...)
Affinity DataIC50:  24nM. Assay description: Concentration required for 50% in vitro inhibition of recombinant human sorbitol dehydrogenase (h-SDH)
In DepthDetails ArticlePubMed