BDBM50108741 1-[4-(4-Isoquinolin-1-yl-piperazin-1-yl)-pyrimidin-2-yl]-ethanol::CHEMBL346418
SMILES C[C@@H](O)c1nccc(n1)N1CCN(CC1)c1nccc2ccccc12
InChI Key InChIKey=MTKBETYFVNKLOG-CQSZACIVSA-N
Data  1 IC50
  Tab Delimited (TSV)   2D SDfile   Computed 3D by Vconf -m prep SDfile
Find this compound or compounds like it in BindingDB:
Activity Spreadsheet -- Enzyme Inhibition Constant Data from BindingDB
Found 1 hit for monomerid = 50108741
TargetSorbitol dehydrogenase(Homo sapiens (Human))
Pfizer
Curated by ChEMBL
LigandPNGBDBM50108741(1-[4-(4-Isoquinolin-1-yl-piperazin-1-yl)-pyrimidin...)
Affinity DataIC50:  34nM. Assay description: Concentration required for 50% in vitro inhibition of recombinant human sorbitol dehydrogenase (h-SDH)
In DepthDetails ArticlePubMed