BDBM50109576 CHEMBL3604154
SMILES Fc1c[nH]nc1C(=O)Nc1ccc(F)cc1Cl
InChI Key InChIKey=OUTKIMDROHEBAR-UHFFFAOYSA-N
Data  1 IC50
  Tab Delimited (TSV)   2D SDfile   Computed 3D by Vconf -m prep SDfile
Find this compound or compounds like it in BindingDB:
Activity Spreadsheet -- Enzyme Inhibition Constant Data from BindingDB
Found 1 hit for monomerid = 50109576
TargetPolyunsaturated fatty acid lipoxygenase ALOX15(Homo sapiens (Human))
Uppsala University
Curated by ChEMBL
LigandPNGBDBM50109576(CHEMBL3604154)
Affinity DataIC50:  42nM. Assay description: Inhibition of 15-LOX-1 in human L1236 cells assessed as reduction in conversion of arachidonic acid to 15-HETE pre-incubated 5 min before arachidonic...
In DepthDetails ArticlePubMed