BDBM50116298 2-[(1-Benzenesulfonyl-cyclopentanecarbonyl)-amino]-3-(2',6'-dimethoxy-biphenyl-4-yl)-propionic acid::CHEMBL305408
SMILES COc1cccc(OC)c1-c1ccc(CC(NC(=O)C2(CCCC2)S(=O)(=O)c2ccccc2)C(O)=O)cc1
InChI Key InChIKey=ASYDYYRPDBLCFU-UHFFFAOYSA-N
Data  2 IC50
  Tab Delimited (TSV)   2D SDfile   Computed 3D by Vconf -m prep SDfile
Find this compound or compounds like it in BindingDB:
Activity Spreadsheet -- Enzyme Inhibition Constant Data from BindingDB
Found 2 hits for monomerid = 50116298
TargetIntegrin alpha-4/beta-7(Homo sapiens (Human))
Merck Research Laboratories
Curated by ChEMBL
LigandPNGBDBM50116298(2-[(1-Benzenesulfonyl-cyclopentanecarbonyl)-amino]...)
Affinity DataIC50:  5nM. Assay description: Inhibition of [125I]MAdCAM-Ig binding to human integrin alpha4-beta7 of RPMI-8866 cells
In DepthDetails ArticlePubMed
TargetIntegrin alpha-4/beta-1(Homo sapiens (Human))
Merck Research Laboratories
Curated by ChEMBL
LigandPNGBDBM50116298(2-[(1-Benzenesulfonyl-cyclopentanecarbonyl)-amino]...)
Affinity DataIC50:  0.110nM. Assay description: Inhibition of [125I]VCAM-Ig binding to human integrin alpha4-beta1 (VLA-4) of Jurkat cells
In DepthDetails ArticlePubMed