BDBM50117069 (S)-2-(2-Chloro-6-methyl-benzoylamino)-3-[4-(2,6-dichloro-benzoylamino)-phenyl]-propionic acid::CHEMBL81990
SMILES Cc1cccc(Cl)c1C(=O)N[C@@H](Cc1ccc(NC(=O)c2c(Cl)cccc2Cl)cc1)C(O)=O
InChI Key InChIKey=JTVWJXUGGJTGDA-IBGZPJMESA-N
Data  7 IC50
  Tab Delimited (TSV)   2D SDfile   Computed 3D by Vconf -m prep SDfile
Find this compound or compounds like it in BindingDB:
Activity Spreadsheet -- Enzyme Inhibition Constant Data from BindingDB
Found 7 hits for monomerid = 50117069
TargetIntegrin alpha-2/beta-1(Homo sapiens (Human))
Sanofi R & D
Curated by ChEMBL
LigandPNGBDBM50117069((S)-2-(2-Chloro-6-methyl-benzoylamino)-3-[4-(2,6-d...)
Affinity DataIC50:  214nM. Assay description: Antagonist activity at recombinant integrin alpha2 beta1 receptor (unknown origin) assessed as inhibition of interaction with biotinylated collagen t...
In DepthDetails ArticlePubMed
TargetIntegrin alpha-4/beta-7(Homo sapiens (Human))
Hoffmann-La Roche
Curated by ChEMBL
LigandPNGBDBM50117069((S)-2-(2-Chloro-6-methyl-benzoylamino)-3-[4-(2,6-d...)
Affinity DataIC50:  43nM. Assay description: Inhibition of human MAdCAM1 binding to integrin alpha4beta7 receptor in human RPMI 8866 cells labeled with Calcein AM
In DepthDetails ArticlePubMed
TargetIntegrin alpha-4/beta-1(Homo sapiens (Human))
Hoffmann-La Roche
Curated by ChEMBL
LigandPNGBDBM50117069((S)-2-(2-Chloro-6-methyl-benzoylamino)-3-[4-(2,6-d...)
Affinity DataIC50:  10nM. Assay description: Inhibition of human VCAM1 binding to integrin alpha4beta1 receptor in human Ramos cells labeled with Calcein AM
In DepthDetails ArticlePubMed
TargetIntegrin alpha-4/beta-1(Homo sapiens (Human))
Hoffmann-La Roche
Curated by ChEMBL
LigandPNGBDBM50117069((S)-2-(2-Chloro-6-methyl-benzoylamino)-3-[4-(2,6-d...)
Affinity DataIC50:  0.300nM. Assay description: Inhibitory binding concentration against VCAM/VLA-4 in ELISA.
In DepthDetails ArticlePubMed
TargetIntegrin alpha-4/beta-1(Homo sapiens (Human))
Hoffmann-La Roche
Curated by ChEMBL
LigandPNGBDBM50117069((S)-2-(2-Chloro-6-methyl-benzoylamino)-3-[4-(2,6-d...)
Affinity DataIC50:  10nM. Assay description: Inhibition of human VCAM1 binding to integrin alpha4beta1 receptor in human Ramos cells labeled with Calcein AM
In DepthDetails ArticlePubMed
TargetIntegrin alpha-4/beta-1(Homo sapiens (Human))
Hoffmann-La Roche
Curated by ChEMBL
LigandPNGBDBM50117069((S)-2-(2-Chloro-6-methyl-benzoylamino)-3-[4-(2,6-d...)
Affinity DataIC50:  12nM. Assay description: Inhibitory binding concentration against VCAM/VLA-4 in Ramos.
In DepthDetails ArticlePubMed
TargetIntegrin alpha-4/beta-7(Homo sapiens (Human))
Hoffmann-La Roche
Curated by ChEMBL
LigandPNGBDBM50117069((S)-2-(2-Chloro-6-methyl-benzoylamino)-3-[4-(2,6-d...)
Affinity DataIC50:  43nM. Assay description: Inhibition of human MAdCAM1 binding to integrin alpha4beta7 receptor in human RPMI 8866 cells labeled with Calcein AM
In DepthDetails ArticlePubMed