BDBM50117164 5-[3-(3-Bromo-phenyl)-propyl]-6-(6-morpholin-4-yl-pyridin-3-ylethynyl)-pyrimidin-4-ylamine::CHEMBL445566
SMILES Nc1ncnc(C#Cc2ccc(nc2)N2CCOCC2)c1CCCc1cccc(Br)c1
InChI Key InChIKey=YNZAYNCLBCHWGK-UHFFFAOYSA-N
Data  1 IC50
  Tab Delimited (TSV)   2D SDfile   Computed 3D by Vconf -m prep SDfile
Find this compound or compounds like it in BindingDB:
Activity Spreadsheet -- Enzyme Inhibition Constant Data from BindingDB
Found 1 hit for monomerid = 50117164
TargetAdenosine kinase(Rattus norvegicus (rat))
Abbott Laboratories
Curated by ChEMBL
LigandPNGBDBM50117164(5-[3-(3-Bromo-phenyl)-propyl]-6-(6-morpholin-4-yl-...)
Affinity DataIC50:  3.5nM. Assay description: Evaluated in vitro for inhibitory activity against Adenosine kinase (AK)
In DepthDetails ArticlePubMed