BDBM50117173 5-{[(2-Chloro-benzyl)-methyl-amino]-methyl}-6-(6-morpholin-4-yl-pyridin-3-ylethynyl)-pyrimidin-4-ylamine::CHEMBL120984
SMILES CN(Cc1ccccc1Cl)Cc1c(N)ncnc1C#Cc1ccc(nc1)N1CCOCC1
InChI Key InChIKey=UIICLAHLPZXQHB-UHFFFAOYSA-N
Data  1 IC50
  Tab Delimited (TSV)   2D SDfile   Computed 3D by Vconf -m prep SDfile
Find this compound or compounds like it in BindingDB:
Activity Spreadsheet -- Enzyme Inhibition Constant Data from BindingDB
Found 1 hit for monomerid = 50117173
TargetAdenosine kinase(Rattus norvegicus (rat))
Abbott Laboratories
Curated by ChEMBL
LigandPNGBDBM50117173(5-{[(2-Chloro-benzyl)-methyl-amino]-methyl}-6-(6-m...)
Affinity DataIC50:  5nM. Assay description: Evaluated in vitro for inhibitory activity against Adenosine kinase (AK)
In DepthDetails ArticlePubMed