BDBM50117607 1-Benzyl-4-[2-(5,6-dimethoxy-benzo[b]thiophen-2-yl)-2-oxo-ethyl]-1-methyl-1,2,3,6-tetrahydro-pyridinium; bromide::CHEMBL314658
SMILES COc1cc2cc(sc2cc1OC)C(=O)CC1=CC[N+](C)(Cc2ccccc2)CC1
InChI Key InChIKey=RWPNUXJCHLIEDT-UHFFFAOYSA-N
Data  1 IC50  1 EC50
  Tab Delimited (TSV)   2D SDfile   Computed 3D by Vconf -m prep SDfile
Find this compound or compounds like it in BindingDB:
Activity Spreadsheet -- Enzyme Inhibition Constant Data from BindingDB
Found 1 hit for monomerid = 50117607
TargetAcetylcholinesterase(Homo sapiens (Human))
Organon Laboratories
Curated by ChEMBL
LigandPNGBDBM50117607(1-Benzyl-4-[2-(5,6-dimethoxy-benzo[b]thiophen-2-yl...)
Affinity DataIC50:  750nM. Assay description: Concentration required for the inhibition of acetylcholinesterase
In DepthDetails ArticlePubMed