BDBM50118707 1-{4-[2,6-Dimethyl-4-(4-methyl-6-phenyl-[1,3,5]triazin-2-yl)-piperazin-1-yl]-pyrimidin-2-yl}-ethanol::CHEMBL139187
SMILES C[C@@H](O)c1nccc(n1)N1[C@@H](C)CN(C[C@H]1C)c1nc(C)nc(n1)-c1ccccc1
InChI Key InChIKey=HCJDSVTUXXPLEB-OWCLPIDISA-N
Data  2 IC50
  Tab Delimited (TSV)   2D SDfile   Computed 3D by Vconf -m prep SDfile
Find this compound or compounds like it in BindingDB:
Activity Spreadsheet -- Enzyme Inhibition Constant Data from BindingDB
Found 2 hits for monomerid = 50118707
TargetSorbitol dehydrogenase(Rattus norvegicus)
Pfizer
Curated by ChEMBL
LigandPNGBDBM50118707(1-{4-[2,6-Dimethyl-4-(4-methyl-6-phenyl-[1,3,5]tri...)
Affinity DataIC50:  39nM. Assay description: Concentration required for 50% in vitro activity against rat SDH (sorbitol dehydrogenase)
In DepthDetails ArticlePubMed
TargetSorbitol dehydrogenase(Homo sapiens (Human))
Pfizer
Curated by ChEMBL
LigandPNGBDBM50118707(1-{4-[2,6-Dimethyl-4-(4-methyl-6-phenyl-[1,3,5]tri...)
Affinity DataIC50:  43nM. Assay description: Concentration required for 50% for in vitro activity against human SDH (sorbitol dehydrogenase)
In DepthDetails ArticlePubMed