BDBM50119307 CHEMBL3613835
SMILES CC[NH+](CC)CC.[H][C@]12CS[C@@H](CCCCC(=O)[N-]S(=O)(=O)OC[C@H]3O[C@H]([C@@H](F)[C@@H]3O)n3cnc4c(N)ncnc34)[C@@]1([H])NC(=O)N2
InChI Key InChIKey=XIWQGBIABRSZPF-GEJZKSIJSA-N
Data  1 Kd
  Tab Delimited (TSV)   2D SDfile   Computed 3D by Vconf -m prep SDfile
Find this compound or compounds like it in BindingDB:
Activity Spreadsheet -- Enzyme Inhibition Constant Data from BindingDB
Found 1 hit for monomerid = 50119307
TargetBiotin--[biotin carboxyl-carrier protein] ligase(Mycobacterium tuberculosis (strain CDC 1551 / Oshk...)
University Of Minnesota
Curated by ChEMBL
LigandPNGBDBM50119307(CHEMBL3613835)
Affinity DataKd:  0.153nM. Assay description: Binding affinity to Mycobacterium tuberculosis H37Rv Biotin protein ligase expressed in Escherichia coli by ITC analysis
In DepthDetails ArticlePubMed