BDBM50119524 4-(4-(4-fluorophenyl)-2-(methylthio)-1H-imidazol-5-yl)pyridine::4-[5-(4-Fluoro-phenyl)-2-methylsulfanyl-3H-imidazol-4-yl]-pyridine::CHEMBL113419::ML-3375
SMILES CSc1nc(c([nH]1)-c1ccc(F)cc1)-c1ccncc1
InChI Key InChIKey=IKQIPPKRAFLUKQ-UHFFFAOYSA-N
Data  6 IC50
  Tab Delimited (TSV)   2D SDfile   Computed 3D by Vconf -m prep SDfile
Find this compound or compounds like it in BindingDB:
Activity Spreadsheet -- Enzyme Inhibition Constant Data from BindingDB
Found 6 hits for monomerid = 50119524
TargetMitogen-activated protein kinase 14(Homo sapiens (Human))
Eberhard-Karls-University TüBingen
Curated by ChEMBL
LigandPNGBDBM50119524(4-(4-(4-fluorophenyl)-2-(methylthio)-1H-imidazol-5...)
Affinity DataIC50:  630nM. Assay description: Inhibition of Mitogen-activated protein kinase p38 (P38 MAPK)
In DepthDetails ArticlePubMed
TargetMitogen-activated protein kinase 11/12/13/14(Homo sapiens (Human))
Eberhard-Karls-University T£Bingen
Curated by ChEMBL
LigandPNGBDBM50119524(4-(4-(4-fluorophenyl)-2-(methylthio)-1H-imidazol-5...)
Affinity DataIC50:  4.20E+3nM. Assay description: Inhibition of p38-related TNF-alpha release by whole blood cells at 10 e-4 to 10 e-8 M
In DepthDetails ArticlePubMed
TargetMitogen-activated protein kinase 11/12/13/14(Homo sapiens (Human))
Eberhard-Karls-University T£Bingen
Curated by ChEMBL
LigandPNGBDBM50119524(4-(4-(4-fluorophenyl)-2-(methylthio)-1H-imidazol-5...)
Affinity DataIC50:  900nM. Assay description: Inhibitory activity against TNF-alpha release in PBM cells
In DepthDetails ArticlePubMed
TargetMitogen-activated protein kinase 11/12/13/14(Homo sapiens (Human))
Eberhard-Karls-University T£Bingen
Curated by ChEMBL
LigandPNGBDBM50119524(4-(4-(4-fluorophenyl)-2-(methylthio)-1H-imidazol-5...)
Affinity DataIC50:  630nM. Assay description: Inhibitory activity against mitogen-activated protein kinase p38 at 10 e-4 to 10 e-8 M concentration
In DepthDetails ArticlePubMed
TargetMitogen-activated protein kinase 11/12/13/14(Homo sapiens (Human))
Eberhard-Karls-University T£Bingen
Curated by ChEMBL
LigandPNGBDBM50119524(4-(4-(4-fluorophenyl)-2-(methylthio)-1H-imidazol-5...)
Affinity DataIC50:  1.20E+3nM. Assay description: Inhibition of p38-related IL1-beta release by whole blood cells at 10 e-4 to 10 e-8 M
In DepthDetails ArticlePubMed
TargetMitogen-activated protein kinase 11/12/13/14(Homo sapiens (Human))
Eberhard-Karls-University T£Bingen
Curated by ChEMBL
LigandPNGBDBM50119524(4-(4-(4-fluorophenyl)-2-(methylthio)-1H-imidazol-5...)
Affinity DataIC50:  44nM. Assay description: Inhibitory activity against induction of IL-1-beta release in PBMCs
In DepthDetails ArticlePubMed